row_id,subject_id,hadm_id,icustay_id,startdate,enddate,drug_type,drug,drug_name_poe,drug_name_generic,formulary_drug_cd,gsn,ndc,prod_strength,dose_val_rx,dose_unit_rx,form_val_disp,form_unit_disp,route
32600,42458,159647,,2146-07-21 00:00:00,2146-07-22 00:00:00,MAIN,Pneumococcal Vac Polyvalent,Pneumococcal Vac Polyvalent,PNEUMOcoccal Vac Polyvalent,PNEU25I,048548,00006494300,25mcg/0.5mL Vial,0.5,mL,1,VIAL,IM
32601,42458,159647,,2146-07-21 00:00:00,2146-07-22 00:00:00,MAIN,Bisacodyl,Bisacodyl,Bisacodyl,BISA5,002947,00536338101,5 mg Tab,10,mg,2,TAB,PO
32602,42458,159647,,2146-07-21 00:00:00,2146-07-22 00:00:00,MAIN,Bisacodyl,Bisacodyl,Bisacodyl (Rectal),BISA10R,002944,00574705050,10mg Suppository,10,mg,1,SUPP,PR
32603,42458,159647,,2146-07-21 00:00:00,2146-07-22 00:00:00,MAIN,Senna,Senna,Senna,SENN187,019964,00904516561,1 Tablet,1,TAB,1,TAB,PO
32604,42458,159647,,2146-07-21 00:00:00,2146-07-21 00:00:00,MAIN,Docusate Sodium (Liquid),Docusate Sodium (Liquid),Docusate Sodium (Liquid),DOCU100L,003017,00121054410,100mg UD Cup,100,mg,1,UDCUP,PO
32605,42458,159647,,2146-07-21 00:00:00,2146-07-22 00:00:00,MAIN,Heparin,Heparin,Heparin Sodium,HEPA5I,006549,63323026201,5000 Units / mL- 1mL Vial,5000,UNIT,1,mL,SC
32606,42458,159647,,2146-07-21 00:00:00,2146-07-22 00:00:00,MAIN,Simvastatin,Simvastatin,Simvastatin,SIMV10,016577,51079045420,10mg Tablet,20,mg,2,TAB,PO
32607,42458,159647,,2146-07-21 00:00:00,2146-07-22 00:00:00,MAIN,Aspirin,Aspirin,Aspirin,ASA81,004380,00904404073,81mg Tab,162,mg,2,TAB,PO
32608,42458,159647,,2146-07-21 00:00:00,2146-07-22 00:00:00,MAIN,Donepezil,Donepezil,Donepezil,DONE5,029335,62856024541,5mg Tablet,10,mg,2,TAB,PO
32609,42458,159647,,2146-07-21 00:00:00,2146-07-22 00:00:00,MAIN,Gabapentin,Gabapentin,Gabapentin,GABA100,021413,00904563161,100mg Capsule,100,mg,1,CAP,PO
32610,42458,159647,,2146-07-21 00:00:00,2146-07-22 00:00:00,MAIN,Namenda,Namenda,*NF* Memantine,MEMA5,053324,00456320563,5mg Tablet,5,mg,1,TAB,ORAL
32611,42458,159647,,2146-07-21 00:00:00,2146-07-22 00:00:00,MAIN,Tolterodine,Tolterodine,Tolterodine,TOLT1,039138,00009454101,1mg Tablet,1,mg,1,TAB,PO
32612,42458,159647,,2146-07-21 00:00:00,2146-07-22 00:00:00,MAIN,Metoprolol Succinate XL,Metoprolol Succinate XL,Metoprolol Succinate XL,TOPR25,047586,58177029311,25mg XL Tab,12.5,mg,0.5,TAB,PO
32613,42458,159647,,2146-07-21 00:00:00,2146-07-22 00:00:00,MAIN,Tamsulosin,Tamsulosin,Tamsulosin,TAMS.4,027546,00597005801,0.4mg Capsule,0.4,mg,1,CAP,PO
32614,42458,159647,,2146-07-21 00:00:00,2146-07-22 00:00:00,MAIN,Docusate Sodium,Docusate Sodium,Docusate Sodium,DOCU100,003009,00904224461,100mg Capsule,100,mg,1,CAP,PO
59637,42275,128293,290478,2135-10-25 00:00:00,2135-10-27 00:00:00,MAIN,Sodium Chloride 0.9%  Flush,Sodium Chloride 0.9%  Flush,Sodium Chloride 0.9%  Flush,NACLFLUSH,,0,Syringe,3,mL,0.6,SYR,IV
59638,42275,128293,290478,2135-10-25 00:00:00,2135-10-27 00:00:00,MAIN,Heparin,Heparin,Heparin Sodium,HEPA5I,006549,63323026201,5000 Units / mL- 1mL Vial,5000,UNIT,1,mL,SC
59639,42275,128293,290478,2135-10-25 00:00:00,2135-10-27 00:00:00,MAIN,Guaifenesin,Guaifenesin,Guaifenesin,GUAI10,000759,00121174410,10mL Cup,5-10,mL,0.5-1,UDCUP,PO
59640,42275,128293,290478,2135-10-25 00:00:00,2135-10-27 00:00:00,MAIN,Albuterol Inhaler,Albuterol Inhaler,Albuterol Inhaler,ALBU17H,005037,17270072101,8 g Inhaler,1-2,PUFF,0.01-0.02,INH,IH
59641,42275,128293,290478,2135-10-25 00:00:00,2135-10-27 00:00:00,MAIN,Amlodipine,Amlodipine,Amlodipine,AMLO5,016926,51079045120,5mg Tablet,5,mg,1,TAB,PO
59642,42275,128293,290478,2135-10-25 00:00:00,2135-10-27 00:00:00,MAIN,Finasteride,Finasteride,Finasteride,FINA5,041440,00555077002,5mgTablet,5,mg,1,TAB,PO
59643,42275,128293,290478,2135-10-25 00:00:00,2135-10-27 00:00:00,MAIN,Gabapentin,Gabapentin,Gabapentin,GABA100,021413,00904563161,100mg Capsule,200,mg,2,CAP,PO
59644,42275,128293,290478,2135-10-25 00:00:00,2135-10-27 00:00:00,MAIN,Levothyroxine Sodium,Levothyroxine Sodium,Levothyroxine Sodium,LEVO75,006650,00074518211,75mcg Tab,75,mcg,1,TAB,PO
59645,42275,128293,290478,2135-10-25 00:00:00,2135-10-27 00:00:00,MAIN,Tamsulosin,Tamsulosin,Tamsulosin,TAMS.4,027546,00597005801,0.4mg Capsule,0.4,mg,1,CAP,PO
59646,42275,128293,290478,2135-10-25 00:00:00,2135-10-27 00:00:00,MAIN,Tiotropium Bromide,Tiotropium Bromide,Tiotropium Bromide,TIOT,050714,00597007575,18mcg Capsule-Inhalation Device,1,CAP,1,CAP,IH
59647,42275,128293,290478,2135-10-25 00:00:00,2135-10-27 00:00:00,MAIN,Aspirin,Aspirin,Aspirin,ASA325,004376,63739002401,325mg Tablet,325,mg,1,TAB,PO
59648,42275,128293,290478,2135-10-25 00:00:00,2135-10-26 00:00:00,MAIN,Azithromycin,Azithromycin,Azithromycin,ZITHR250,026721,59762306003,250 mg Tab,500,mg,2,TAB,PO
59649,42275,128293,290478,2135-10-25 00:00:00,2135-10-25 00:00:00,MAIN,Azithromycin,Azithromycin,Azithromycin,ZITHR250,026721,59762306003,250 mg Tab,250,mg,1,TAB,PO
59650,42275,128293,290478,2135-10-25 00:00:00,2135-10-27 00:00:00,MAIN,PredniSONE,PredniSONE,PredniSONE,PRED20,006751,00054001820,20 mg Tablet,60,mg,3,TAB,PO
59651,42275,128293,290478,2135-10-25 00:00:00,2135-10-27 00:00:00,MAIN,Docusate Sodium,Docusate Sodium,Docusate Sodium,DOCU100,003009,00904224461,100mg Capsule,100,mg,1,CAP,PO
59652,42275,128293,290478,2135-10-25 00:00:00,2135-10-27 00:00:00,MAIN,Senna,Senna,Senna,SENN187,019964,00904516561,1 Tablet,1,TAB,1,TAB,PO
59653,42275,128293,290478,2135-10-25 00:00:00,2135-10-27 00:00:00,MAIN,Sodium Chloride Nasal,Sodium Chloride Nasal,Sodium Chloride Nasal,SODI65S,008084,00256015201,45mL Bottle,1-2,SPRY,1-2,SPRY,NU
59654,42275,128293,290478,2135-10-25 00:00:00,2135-10-27 00:00:00,MAIN,Sodium Chloride 0.9%  Flush,Sodium Chloride 0.9%  Flush,Sodium Chloride 0.9%  Flush,NACLFLUSH,,0,Syringe,3,mL,0.6,SYR,IV
59655,42275,128293,290478,2135-10-26 00:00:00,2135-10-27 00:00:00,MAIN,Azithromycin,Azithromycin,Azithromycin,ZITHR250,026721,59762306003,250 mg Tab,500,mg,2,TAB,PO
59656,42275,128293,,2135-10-27 00:00:00,2135-10-27 00:00:00,MAIN,PredniSONE,PredniSONE,PredniSONE,PRED20,006751,00054001820,20 mg Tablet,60,mg,3,TAB,PO
86431,43735,112662,,2128-11-04 00:00:00,2128-11-09 00:00:00,MAIN,Pneumococcal Vac Polyvalent,Pneumococcal Vac Polyvalent,PNEUMOcoccal Vac Polyvalent,PNEU25I,048548,00006494300,25mcg/0.5mL Vial,0.5,mL,1,VIAL,IM
86432,43735,112662,,2128-11-04 00:00:00,2128-11-09 00:00:00,MAIN,Heparin Flush (10 units/ml),Heparin Flush (10 units/ml),Heparin Flush (10 Units/mL),HEPA10SYR,060304,08290036005,10 Units/mL - 5 mL Syringe,1,mL,0.2,SYR,IV
86433,43735,112662,,2128-11-04 00:00:00,2128-11-09 00:00:00,MAIN,Multivitamins,Multivitamins,Multivitamins,MVI,002532,00904053061,1 Tablet,1,TAB,1,TAB,PO
86434,43735,112662,,2128-11-04 00:00:00,2128-11-09 00:00:00,MAIN,Ferrous Sulfate,Ferrous Sulfate,Ferrous Sulfate,FERR325,001645,00182402889,325 mg Tablet,325,mg,1,TAB,PO
86435,43735,112662,,2128-11-04 00:00:00,2128-11-09 00:00:00,MAIN,Ipratropium Bromide Neb,Ipratropium Bromide Neb,Ipratropium Bromide Neb,IPRA2H,021700,00487980125,2.5mL Vial,1,NEB,1,VIAL,IH
86436,43735,112662,,2128-11-04 00:00:00,2128-11-09 00:00:00,MAIN,Albuterol 0.083% Neb Soln,Albuterol 0.083% Neb Soln,Albuterol 0.083% Neb Soln,ALBU3H,005039,49502069724,0.083%;3mL Vial,1,NEB,1,VIAL,IH
86571,43735,112662,,2128-11-04 00:00:00,2128-11-09 00:00:00,MAIN,Sertraline,Sertraline,Sertraline,SERT100,046228,00904586761,100mg Tablet,100,mg,1,TAB,PO
86572,43735,112662,,2128-11-04 00:00:00,2128-11-09 00:00:00,MAIN,Simvastatin,Simvastatin,Simvastatin,SIMV40,016579,51079045620,40mg Tablet,80,mg,2,TAB,PO
86573,43735,112662,,2128-11-04 00:00:00,2128-11-09 00:00:00,MAIN,Levothyroxine Sodium,Levothyroxine Sodium,Levothyroxine Sodium,LEVO100,006651,00074662411,100mcg Tablet,200,mcg,2,TAB,PO
86574,43735,112662,,2128-11-04 00:00:00,2128-11-09 00:00:00,MAIN,Allopurinol,Allopurinol,Allopurinol,ALLO100,002535,51079020520,100mg Tab,100,mg,1,TAB,PO
86575,43735,112662,293363,2128-11-05 00:00:00,2128-11-09 00:00:00,MAIN,Pantoprazole,Pantoprazole,Pantoprazole,PANT40,027462,00008084199,40mg Tablet,40,mg,1,TAB,PO
86576,43735,112662,293363,2128-11-05 00:00:00,2128-11-06 00:00:00,MAIN,Furosemide,Furosemide,Furosemide,FURO40I,008205,00517570425,40mg/4mL Vial,40,mg,1,VIAL,IV
86577,43735,112662,293363,2128-11-05 00:00:00,2128-11-05 00:00:00,MAIN,Carvedilol,Carvedilol,Carvedilol,CARV3125,028108,51079077120,3.125mg Tablet,3.125,mg,1,TAB,PO
86578,43735,112662,293363,2128-11-05 00:00:00,2128-11-05 00:00:00,MAIN,Carvedilol,Carvedilol,Carvedilol,CARV3125,028108,51079077120,3.125mg Tablet,3.125,mg,1,TAB,PO
86579,43735,112662,293363,2128-11-05 00:00:00,2128-11-09 00:00:00,MAIN,Metoprolol Tartrate,Metoprolol Tartrate,Metoprolol Tartrate,METO25,050631,51079025520,25mg Tablet,12.5,mg,0.5,TAB,PO
86580,43735,112662,293363,2128-11-06 00:00:00,2128-11-09 00:00:00,MAIN,Heparin,Heparin,Heparin Sodium,HEPA5I,006549,63323026201,5000 Units / mL- 1mL Vial,5000,UNIT,1,mL,SC
86581,43735,112662,293363,2128-11-06 00:00:00,2128-11-07 00:00:00,MAIN,Furosemide,Furosemide,Furosemide,FURO40I,008205,00517570425,40mg/4mL Vial,40,mg,1,VIAL,IV
86582,43735,112662,293363,2128-11-06 00:00:00,2128-11-07 00:00:00,MAIN,Furosemide,Furosemide,Furosemide,FURO40I,008205,00517570425,40mg/4mL Vial,40,mg,1,VIAL,IV
86583,43735,112662,293363,2128-11-06 00:00:00,2128-11-09 00:00:00,MAIN,Senna,Senna,Senna,SENN187,019964,00904516561,1 Tablet,1,TAB,1,TAB,PO
86584,43735,112662,293363,2128-11-06 00:00:00,2128-11-09 00:00:00,MAIN,Docusate Sodium,Docusate Sodium,Docusate Sodium,DOCU100,003009,00904224461,100mg Capsule,100,mg,1,CAP,PO
86585,43735,112662,,2128-11-07 00:00:00,2128-11-08 00:00:00,MAIN,Furosemide,Furosemide,Furosemide,FURO40I,008205,00517570425,40mg/4mL Vial,40,mg,1,VIAL,IV
86586,43735,112662,,2128-11-07 00:00:00,2128-11-08 00:00:00,MAIN,Metoprolol Tartrate,Metoprolol Tartrate,Metoprolol Tartrate,METO5I,019808,00143987310,5mg/5mL Vial,5,mg,1,VIAL,IV
86587,43735,112662,,2128-11-08 00:00:00,2128-11-09 00:00:00,MAIN,Furosemide,Furosemide,Furosemide,FURO40I,008205,00517570425,40mg/4mL Vial,80,mg,2,VIAL,IV
86588,43735,112662,,2128-11-08 00:00:00,2128-11-10 00:00:00,MAIN,Sodium Chloride 0.9%  Flush,Sodium Chloride 0.9%  Flush,Sodium Chloride 0.9%  Flush,NACLFLUSH,,0,Syringe,3,mL,0.6,SYR,IV
86589,43735,112662,,2128-11-08 00:00:00,2128-11-09 00:00:00,MAIN,Metoprolol Tartrate,Metoprolol Tartrate,Metoprolol Tartrate,METO5I,019808,00143987310,5mg/5mL Vial,5,mg,1,VIAL,IV
86590,43735,112662,283181,2128-11-09 00:00:00,2128-11-09 00:00:00,MAIN,Lactulose,Lactulose,Lactulose,LACT30L,003067,00054848616,20g/30mL Cup,30,mL,1,UDCUP,PO
86591,43735,112662,283181,2128-11-09 00:00:00,2128-11-09 00:00:00,MAIN,Metoprolol Tartrate,Metoprolol Tartrate,Metoprolol Tartrate,METO25,050631,51079025520,25mg Tablet,12.5,mg,0.5,TAB,PO
86592,43735,112662,283181,2128-11-09 00:00:00,2128-11-09 00:00:00,MAIN,Rifaximin,Rifaximin,Rifaximin,RIFA200,041880,65649030105,200mg Tablet,400,mg,2,TAB,PO
86593,43735,112662,283181,2128-11-09 00:00:00,2128-11-09 00:00:00,MAIN,Metoprolol Tartrate,Metoprolol Tartrate,Metoprolol Tartrate,METO5I,019808,00143987310,5mg/5mL Vial,5,mg,1,VIAL,IV
86594,43735,112662,283181,2128-11-09 00:00:00,2128-11-09 00:00:00,MAIN,Fentanyl Citrate,Fentanyl Citrate,Fentanyl,FENT2.550,041385,10019003783,2.5mg/50mL Solution,2.5,mg,1,BAG,IV DRIP
86595,43735,112662,283181,2128-11-09 00:00:00,2128-11-09 00:00:00,MAIN,Midazolam,Midazolam,Midazolam,MIDA100,003780,10019002710,100mg/100mL NS,100,mg,1,BAG,IV DRIP
86596,43735,112662,283181,2128-11-09 00:00:00,2128-11-09 00:00:00,MAIN,Propofol,Propofol,Propofol,PROP100IG,016796,63323026965,1000mg/100mL Vial,1000,mg,1,VIAL,IV DRIP
86597,43735,112662,283181,2128-11-09 00:00:00,2128-11-09 00:00:00,MAIN,Atropine Sulfate,Atropine Sulfate,Atropine Sulfate,ATRO1I,004817,00409491134,1mg/10mL Syringe,1,mg,1,SYR,IV
86598,43735,112662,283181,2128-11-09 00:00:00,2128-11-09 00:00:00,MAIN,Chlorhexidine Gluconate 0.12% Oral Rinse,Chlorhexidine Gluconate 0.12% Oral Rinse,Chlorhexidine Gluconate,CHLO15L,057959,54569523500,15ml Cup,15,mL,1,UDCUP,ORAL
86599,43735,112662,283181,2128-11-09 00:00:00,2128-11-09 00:00:00,MAIN,Ipratropium Bromide Neb,Ipratropium Bromide Neb,Ipratropium Bromide Neb,IPRA2H,021700,00487980125,2.5mL Vial,1,NEB,1,VIAL,IH
86600,43735,112662,283181,2128-11-09 00:00:00,2128-11-10 00:00:00,MAIN,Ipratropium Bromide MDI,Ipratropium Bromide MDI,Ipratropium Bromide HFA,IPRAPF,059081,00597008717,12.9g Inhaler,2,PUFF,0.01,INH,IH
86601,43735,112662,283181,2128-11-09 00:00:00,2128-11-10 00:00:00,MAIN,Albuterol Inhaler,Albuterol Inhaler,Albuterol Inhaler (ProAir),PROAIR8.5H,028090,59310057920,8.5 g Inhaler,2-4,PUFF,0.01-0.02,INH,IH
86602,43735,112662,283181,2128-11-09 00:00:00,2128-11-10 00:00:00,MAIN,Morphine Sulfate,Morphine Sulfate,Morphine Sulfate (Syringe),MORP2I,004070,00409176230,2mg Syringe,2,mg,1,SYR,IV
86603,43735,112662,,2128-11-04 00:00:00,2128-11-06 00:00:00,BASE,1/2 NS,,,NS451000,001209,00338004304,1000mL Bag,1000,mL,1000,mL,IV
86604,43735,112662,,2128-11-04 00:00:00,2128-11-05 00:00:00,BASE,Vial,,,VIAL,,0,Send Vial,1,VIAL,1,VIAL,IV
86605,43735,112662,293363,2128-11-06 00:00:00,2128-11-06 00:00:00,BASE,0.9% Sodium Chloride,,,NS500,001210,00338004903,500mL Bag,500,mL,500,mL,IV
86606,43735,112662,,2128-11-08 00:00:00,2128-11-09 00:00:00,BASE,Iso-Osmotic Dextrose,,,VANCOBASE,,0,200ml Bag,200,mL,200,mL,IV
86607,43735,112662,,2128-11-08 00:00:00,2128-11-09 00:00:00,BASE,0.9% Sodium Chloride (Mini Bag Plus),,,NS/MBP100I,001210,00338055318,100mL Bag,100,mL,1,BAG,IV
86608,43735,112662,,2128-11-08 00:00:00,2128-11-09 00:00:00,BASE,NS,,,METRBASE,,0,100ml,100,mL,100,mL,IV
86609,43735,112662,,2128-11-08 00:00:00,2128-11-09 00:00:00,BASE,Iso-Osmotic Dextrose,,,VANCOBASE,,0,200ml Bag,200,mL,200,mL,IV
86610,43735,112662,,2128-11-08 00:00:00,2128-11-09 00:00:00,BASE,0.9% Sodium Chloride (Mini Bag Plus),,,NS/MBP100I,001210,00338055318,100mL Bag,100,mL,1,BAG,IV
86611,43735,112662,,2128-11-08 00:00:00,2128-11-09 00:00:00,BASE,5% Dextrose,,,D5W100,001972,00409792337,100mL Bag,100,mL,100,mL,IV DRIP
86612,43735,112662,283181,2128-11-09 00:00:00,2128-11-09 00:00:00,BASE,5% Dextrose,,,D5W100,001972,00409792337,100mL Bag,100,mL,100,mL,IV DRIP
86613,43735,112662,283181,2128-11-09 00:00:00,2128-11-09 00:00:00,BASE,Vial,,,VIAL,,0,Send Vial,1,VIAL,1,VIAL,IV
86614,43735,112662,283181,2128-11-09 00:00:00,2128-11-09 00:00:00,BASE,5% Dextrose,,,D5W250,001972,00338001702,250mL Bag,250,mL,250,mL,IV DRIP
86615,43735,112662,283181,2128-11-09 00:00:00,2128-11-09 00:00:00,BASE,0.9% Sodium Chloride,,,NS1000,001210,00338004904,1000mL Bag,1000,mL,1,BAG,IV
86616,43735,112662,283181,2128-11-09 00:00:00,2128-11-10 00:00:00,BASE,D5W,,,MORPD5W,,0,100mL Bottle,100,mL,1,BTL,IV DRIP
86617,43735,112662,,2128-11-04 00:00:00,2128-11-05 00:00:00,MAIN,Pantoprazole Sodium,,,PANT40I,047635,00008092355,40mg Vial,40,mg,1,VIAL,IV
86749,43735,112662,,2128-11-08 00:00:00,2128-11-09 00:00:00,MAIN,Vancomycin,,,VANC1F,043952,00338355248,1g Frozen Bag,1000,mg,1,BAG,IV
86750,43735,112662,,2128-11-08 00:00:00,2128-11-09 00:00:00,MAIN,CefePIME,,,CEFE2I,024095,60505068104,2g Vial,2,gm,1,mL,IV
86751,43735,112662,,2128-11-08 00:00:00,2128-11-09 00:00:00,MAIN,MetRONIDAZOLE (FLagyl),,,METR500PM,009588,00409781124,500mg Premix Bag,500,mg,1,BAG,IV
86752,43735,112662,,2128-11-08 00:00:00,2128-11-09 00:00:00,MAIN,Vancomycin,,,VANC1F,043952,00338355248,1g Frozen Bag,1000,mg,1,BAG,IV
86753,43735,112662,,2128-11-08 00:00:00,2128-11-09 00:00:00,MAIN,CefePIME,,,CEFE1I,024094,60505083404,1g Vial,1,g,10,mL,IV
86754,43735,112662,,2128-11-08 00:00:00,2128-11-09 00:00:00,MAIN,Furosemide,,,FURO100I,008205,00517571025,100mg/10mL Vial,100,mg,1,VIAL,IV DRIP
86755,43735,112662,283181,2128-11-09 00:00:00,2128-11-09 00:00:00,MAIN,Furosemide,,,FURO100I,008205,00517571025,100mg/10mL Vial,100,mg,1,VIAL,IV DRIP
86756,43735,112662,283181,2128-11-09 00:00:00,2128-11-09 00:00:00,MAIN,Pantoprazole Sodium,,,PANT40I,047635,00008092355,40mg Vial,40,mg,1,VIAL,IV
86757,43735,112662,283181,2128-11-09 00:00:00,2128-11-09 00:00:00,MAIN,Norepinephrine,,,LEVO4I,028633,00703115303,4mg/4mL Amp,8,mg,2,AMP,IV DRIP
86758,43735,112662,283181,2128-11-09 00:00:00,2128-11-10 00:00:00,MAIN,Morphine Sulfate,,,MORP100PM,059940,00409606211,100mg/100mL Premix,100,mg,1,BTL,IV DRIP
126831,43746,167181,,2110-12-29 00:00:00,2111-01-01 00:00:00,MAIN,Pneumococcal Vac Polyvalent,Pneumococcal Vac Polyvalent,PNEUMOcoccal Vac Polyvalent,PNEU25I,048548,00006494300,25mcg/0.5mL Vial,0.5,mL,1,VIAL,IM
126832,43746,167181,,2110-12-29 00:00:00,2111-01-06 00:00:00,MAIN,Sodium Chloride 0.9%  Flush,Sodium Chloride 0.9%  Flush,Sodium Chloride 0.9%  Flush,NACLFLUSH,,0,Syringe,3,mL,0.6,SYR,IV
126833,43746,167181,,2110-12-29 00:00:00,2111-01-06 00:00:00,MAIN,Pantoprazole,Pantoprazole,Pantoprazole,PANT40,027462,00008084199,40mg Tablet,40,mg,1,TAB,PO
126834,43746,167181,,2110-12-29 00:00:00,2111-01-04 00:00:00,MAIN,Oxycodone-Acetaminophen,Oxycodone-Acetaminophen,Oxycodone-Acetaminophen,PERC,004222,63481062375,5mg/325mg Tablet,1-2,TAB,1-2,TAB,PO
126835,43746,167181,,2110-12-29 00:00:00,2111-01-06 00:00:00,MAIN,Paroxetine,Paroxetine,Paroxetine,PARO10,046222,00904567661,10mg Tablet,10,mg,1,TAB,PO
126836,43746,167181,,2110-12-29 00:00:00,2111-01-06 00:00:00,MAIN,Ascorbic Acid,Ascorbic Acid,Ascorbic Acid,ASCO500,002151,37205014472,500 mg Tab,500,mg,1,TAB,PO
126837,43746,167181,,2110-12-29 00:00:00,2111-01-06 00:00:00,MAIN,Bisacodyl,Bisacodyl,Bisacodyl,BISA5,002947,00182853489,5 mg Tab,10,mg,2,TAB,PO
126838,43746,167181,,2110-12-29 00:00:00,2110-12-30 00:00:00,MAIN,Senna,Senna,Senna,SENN187,019964,00904516561,1 Tablet,2,TAB,2,TAB,PO
126839,43746,167181,,2110-12-29 00:00:00,2110-12-30 00:00:00,MAIN,Docusate Sodium,Docusate Sodium,Docusate Sodium,DOCU100,003009,00904224461,100mg Capsule,100,mg,1,CAP,PO
126840,43746,167181,,2110-12-29 00:00:00,2111-01-06 00:00:00,MAIN,Creon 10,Creon 10,Creon 10,CREO10,020986,00032121001,1 Capsule,2,CAP,2,CAP,PO
126841,43746,167181,,2110-12-29 00:00:00,2111-01-04 00:00:00,MAIN,Acetaminophen,Acetaminophen,Acetaminophen,ACET325,004489,00182844789,325mg Tablet,325-650,mg,1-2,TAB,PO
126842,43746,167181,,2110-12-29 00:00:00,2111-01-06 00:00:00,MAIN,Ondansetron,Ondansetron,Ondansetron,ONDAN4I,061716,00781305714,2mg/mL-2mL,8,mg,2,VIAL,IV
126843,43746,167181,,2110-12-29 00:00:00,2110-12-30 00:00:00,MAIN,DiphenhydrAMINE,DiphenhydrAMINE,DiphenhydrAMINE,DIPH25,011582,17714002001,25mg Cap,25,mg,1,CAP,PO
126844,43746,167181,,2110-12-30 00:00:00,2111-01-06 00:00:00,MAIN,Docusate Sodium,Docusate Sodium,Docusate Sodium,DOCU100,003009,00904224461,100mg Capsule,100,mg,1,CAP,PO
126845,43746,167181,,2110-12-30 00:00:00,2111-01-06 00:00:00,MAIN,Senna,Senna,Senna,SENN187,019964,00904516561,1 Tablet,2,TAB,2,TAB,PO
126846,43746,167181,,2110-12-31 00:00:00,2111-01-04 00:00:00,MAIN,Ciprofloxacin HCl,Ciprofloxacin HCl,Ciprofloxacin HCl,CIPR500,009510,00172531210,500mg Tab,500,mg,1,TAB,PO
126847,43746,167181,,2111-01-01 00:00:00,2111-01-06 00:00:00,MAIN,Polyethylene Glycol,Polyethylene Glycol,Polyethylene Glycol,GLYC17,041843,51991045757,17g Packet,17,g,1,PKT,PO
126848,43746,167181,,2111-01-01 00:00:00,2111-01-02 00:00:00,MAIN,Magnesium Sulfate,Magnesium Sulfate,Magnesium Sulfate,MAG2PM,016546,00409672924,2 g / 50 mL Premix Bag,2,gm,1,BAG,IV
126849,43746,167181,,2111-01-03 00:00:00,2111-01-13 00:00:00,MAIN,Heparin,Heparin,Heparin Sodium,HEPA5I,006549,63323026201,5000 Units / mL- 1mL Vial,5000,UNIT,1,mL,SC
126850,43746,167181,,2111-01-03 00:00:00,2111-01-04 00:00:00,MAIN,Neutra-Phos,Neutra-Phos,Neutra-Phos,NEUT,063337,60258000601,Powder Packet,2,PKT,2,PKT,PO
126851,43746,167181,,2111-01-04 00:00:00,2111-01-04 00:00:00,MAIN,Morphine Sulfate,Morphine Sulfate,Morphine Sulfate (Syringe),MORP2I,004070,00409176230,2mg Syringe,2,mg,1,SYR,IV
126852,43746,167181,,2111-01-04 00:00:00,2111-01-04 00:00:00,MAIN,Morphine Sulfate,Morphine Sulfate,Morphine Sulfate (Syringe),MORP2I,004070,00409176230,2mg Syringe,1-2,mg,0.5-1,SYR,IV
126853,43746,167181,,2111-01-04 00:00:00,2111-01-04 00:00:00,MAIN,Morphine Sulfate IR,Morphine Sulfate IR,Morphine Sulfate (Immediate Release),MORP15,004091,00054023524,15mg Tab,15,mg,1,TAB,PO
126854,43746,167181,,2111-01-04 00:00:00,2111-01-06 00:00:00,MAIN,Acetylcysteine 20%,Acetylcysteine 20%,Acetylcysteine 20%,ACET20/4I,000592,00517760425,800mg/4ml Vial,600,mg,0.75,VIAL,PO
126855,43746,167181,,2111-01-04 00:00:00,2111-01-06 00:00:00,MAIN,Morphine Sulfate IR,Morphine Sulfate IR,Morphine Sulfate (Immediate Release),MORP15,004091,00054023524,15mg Tab,15-30,mg,1-2,TAB,PO
126856,43746,167181,,2111-01-04 00:00:00,2111-01-10 00:00:00,MAIN,Morphine Sulfate,Morphine Sulfate,Morphine Sulfate (Syringe),MORP2I,004070,00409176230,2mg Syringe,2-4,mg,1-2,SYR,IV
126857,43746,167181,,2111-01-04 00:00:00,2111-01-06 00:00:00,MAIN,Morphine Sulfate IR,Morphine Sulfate IR,Morphine Sulfate (Immediate Release),MORP15,004091,00054023524,15mg Tab,15,mg,1,TAB,PO
126858,43746,167181,,2111-01-04 00:00:00,2111-01-06 00:00:00,MAIN,Morphine Sulfate IR,Morphine Sulfate IR,Morphine Sulfate (Immediate Release),MORP30,004092,00054023624,30mg Tab,30,mg,1,TAB,PO
127012,43746,167181,,2111-01-04 00:00:00,2111-01-10 00:00:00,MAIN,Morphine Sulfate,Morphine Sulfate,Morphine Sulfate (Syringe),MORP2I,004070,00409176230,2mg Syringe,2,mg,1,SYR,IV
127013,43746,167181,,2111-01-04 00:00:00,2111-01-10 00:00:00,MAIN,Morphine Sulfate,Morphine Sulfate,Morphine Sulfate (Syringe),MORP4I,004072,00409125830,4mg Syringe,4,mg,1,SYR,IV
127014,43746,167181,,2111-01-06 00:00:00,2111-01-14 00:00:00,MAIN,Sodium Chloride 0.9%  Flush,Sodium Chloride 0.9%  Flush,Sodium Chloride 0.9%  Flush,NACLFLUSH,,0,Syringe,3,mL,0.6,SYR,IV
127015,43746,167181,,2111-01-06 00:00:00,2111-01-13 00:00:00,MAIN,Acetaminophen,Acetaminophen,Acetaminophen,ACET325,004489,00182844789,325mg Tablet,325-650,mg,1-2,TAB,PO
127016,43746,167181,,2111-01-07 00:00:00,2111-01-08 00:00:00,MAIN,Sodium Chloride 0.9%  Flush,Sodium Chloride 0.9%  Flush,Sodium Chloride 0.9%  Flush,NACLFLUSH,,0,Syringe,3,mL,0.6,SYR,IV
127017,43746,167181,,2111-01-07 00:00:00,2111-01-08 00:00:00,MAIN,Sodium Chloride 0.9%  Flush,Sodium Chloride 0.9%  Flush,Sodium Chloride 0.9%  Flush,NACLFLUSH,,0,Syringe,3,mL,0.6,SYR,IV
127018,43746,167181,,2111-01-07 00:00:00,2111-01-08 00:00:00,MAIN,Albumin 25% (12.5g / 50mL),Albumin 25% (12.5g / 50mL),Albumin 25% (12.5g / 50mL),ALBU25,006329,67467064301,25%-50mL,25,g,2,VIAL,IV
127019,43746,167181,,2111-01-07 00:00:00,2111-01-09 00:00:00,MAIN,Magnesium Sulfate,Magnesium Sulfate,Magnesium Sulfate,MAG2PM,016546,00409672924,2 g / 50 mL Premix Bag,2-4,gm,1-2,BAG,IV
127020,43746,167181,,2111-01-07 00:00:00,2111-01-09 00:00:00,MAIN,Magnesium Sulfate,Magnesium Sulfate,Magnesium Sulfate,MAG2PM,016546,00409672924,2 g / 50 mL Premix Bag,2,gm,1,BAG,IV
127021,43746,167181,289236,2111-01-08 00:00:00,2111-01-08 00:00:00,MAIN,Albumin 25% (12.5g / 50mL),Albumin 25% (12.5g / 50mL),Albumin 25% (12.5g / 50mL),ALBU25,006329,67467064301,25%-50mL,25,g,2,VIAL,IV
127022,43746,167181,289236,2111-01-08 00:00:00,2111-01-10 00:00:00,MAIN,Albumin 25% (12.5g / 50mL),Albumin 25% (12.5g / 50mL),Albumin 25% (12.5g / 50mL),ALBU25,006329,67467064301,25%-50mL,25,g,2,VIAL,IV
127023,43746,167181,289236,2111-01-09 00:00:00,2111-01-09 00:00:00,MAIN,Paroxetine,Paroxetine,Paroxetine,PARO10,046222,00904567661,10mg Tablet,10,mg,1,TAB,PO
127024,43746,167181,289236,2111-01-09 00:00:00,2111-01-09 00:00:00,MAIN,Valsartan,Valsartan,Valsartan,VALS160,048400,00078035934,160mg Tablet,160,mg,1,TAB,PO
127025,43746,167181,289236,2111-01-09 00:00:00,2111-01-09 00:00:00,MAIN,Multivitamins,Multivitamins,Multivitamins,MVI,002532,00904053061,1 Tablet,1,TAB,1,TAB,PO
127026,43746,167181,289236,2111-01-09 00:00:00,2111-01-13 00:00:00,MAIN,Sodium Chloride 0.9%  Flush,Sodium Chloride 0.9%  Flush,Sodium Chloride 0.9%  Flush,NACLFLUSH,,0,Syringe,3,mL,0.6,SYR,IV
127027,43746,167181,289236,2111-01-09 00:00:00,2111-01-13 00:00:00,MAIN,Calcium Carbonate,Calcium Carbonate,Calcium Carbonate,CAL1250,001340,00054812025,1250mg Tablet,1250,mg,1,TAB,PO